{"text_format":"1","workbook":"xlsx","n_sheets":5,"sheets":["INGRESO DE DATOS","Global Premier Health  Plan","Global Select Health  Plan","Resumen tarifas","Tablas"],"not_rendered":{"charts":0,"images":5,"macros":1,"external_links":0,"defined_names":3,"comments":1,"pivot_tables":0},"unopened":[],"bounds":{"document_bytes":16777216,"sheet_cells":100000,"rows_first":2000,"rows_last":500,"rows_between":2000,"halvings":0,"cell_chars":16384,"cell_head_chars":4096},"cells_cut":0,"cells_raw":0,"read":"whole","date_system":"1900"}

{"sheet":"INGRESO DE DATOS","index":0,"n_rows":30,"n_cols":8,"rows_kept":30,"cut":false,"hidden":false,"merged":[[20,3,20,7],[26,1,28,1],[26,3,28,3],[9,0,9,12],[18,5,18,6],[14,1,14,2],[16,1,16,2],[14,3,14,7],[16,5,16,6],[18,1,18,2]]}
[]
[]
[]
[]
[]
[]
[]
[]
[]
[]
[]
[]
["LLENE LA INFORMACIÓN DEL ASEGURADO PROPUESTO:"]
[]
[null,"Nombre del Asegurado Titular",null,"JOHN DOE"]
[]
[null,"Número de adultos en la póliza",null,2,null,"Número de niños en la póliza",null,2]
[]
[null,"Edad del Asegurado Titular",null,32,null,"Edad del/la cónyuge ",null,46]
[]
[null,null,"Cotizador por","NOMBRE DEL AGENTE"]
[]
[]
[]
["SELECCIONE EL PRODUCTO PARA VER LA COTIZACIÓN CORRESPONDIENTE: "]
[]
[null,"Número de niños menores de 16 años: (Incluir en ésta casilla solo la cantidad de niños cuya edad sea menor de 16 años)",null,"Número de niños menores de 10 años: (Incluir en ésta casilla solo la cantidad de niños cuya edad sea menor de 10 años)"]
[]
[]
[null,1,null,1]

{"sheet":"Global Premier Health  Plan","index":1,"n_rows":75,"n_cols":10,"rows_kept":75,"cut":false,"hidden":false,"merged":[[12,0,12,1],[13,0,13,1],[14,0,14,1],[73,4,73,9],[74,4,75,9],[62,0,62,1],[73,0,73,1],[12,5,12,8],[14,5,14,8],[41,0,41,1],[42,1,43,1],[42,0,43,0],[77,0,77,1],[87,0,87,1],[12,3,12,4],[16,3,16,4],[18,3,18,4],[51,4,51,5],[52,4,52,5],[64,4,64,5],[65,4,65,5],[26,4,26,9],[36,4,36,9],[47,4,47,9],[60,4,60,9],[58,0,58,1],[21,0,21,1],[36,0,36,1]]}
[null,null,null,null,null,null,null," "," "," "]
[]
[]
[]
[]
[]
[]
[]
[]
[]
[]
[]
["Global Premier Health Plan",null,null,"Nombre del Asegurado Titular:",null,{"$f":"+'INGRESO DE DATOS'!$D$15","v":"JOHN DOE"}]
[]
[null,null,null,null,"Cotizado por:",{"$f":"+'INGRESO DE DATOS'!$D$21","v":"NOMBRE DEL AGENTE"}]
[]
[null,null,null,"Número de adultos en la póliza:",null,{"$f":"+'INGRESO DE DATOS'!$D$17","v":2},null,"Edad del Asegurado Titular:",{"$f":"+'INGRESO DE DATOS'!$D$19","v":32}]
[]
[null,null,null,"Número de niños en la póliza:",null,{"$f":"+'INGRESO DE DATOS'!$H$17","v":2},null,"Edad del/la conyuge:",{"$f":"+'INGRESO DE DATOS'!$H$19","v":46}]
[null,null,null,null,null,null,null," "," "]
[null,null,null,null,"Fecha de la cotización :",{"$f":"NOW()","v":"2023-04-17T12:29:16.010"}]
[null,null,null,null,null,null," ",false,null," "]
[null,null,null,null,"Deducibles",null,"PLAN 1","PLAN 2","PLAN 3","PLAN 4"]
[null,null,null,null,"En el país de residencia",null,250,2000,5000,10000]
[null,null,null,null,"Fuera del país de residencia",null,5000,2000,5000,10000]
[]
[null,null,null,null,"Tarifas Anuales"]
[null,null,null,null,"Prima para Asegurado Titular",null,{"$f":"(VLOOKUP($I$17,Tablas!$A$155:$G$221,3,TRUE))*1.1494","v":6076.0962080000008},{"$f":"(VLOOKUP($I$17,Tablas!$A$155:$G$221,4,TRUE))*1.1494","v":5514.1315600000007},{"$f":"(VLOOKUP($I$17,Tablas!$A$155:$G$221,5,TRUE))*1.1494","v":4050.2097440000002},{"$f":"(VLOOKUP($I$17,Tablas!$A$155:$G$221,6,TRUE))*1.1494","v":2958.3257200000003}]
[null,null,null,null,"Prima para conyuge",null,{"$f":"(IF($F$17=1,0,(VLOOKUP($I$19,Tablas!$A$155:$G$221,3,TRUE))))*1.1494","v":8781.9677119999997},{"$f":"(IF($F$17=1,0,(VLOOKUP($I$19,Tablas!$A$155:$G$221,4,TRUE))))*1.1494","v":7970.6752160000005},{"$f":"(IF($F$17=1,0,(VLOOKUP($I$19,Tablas!$A$155:$G$221,5,TRUE))))*1.1494","v":5721.2534400000004},{"$f":"(IF($F$17=1,0,(VLOOKUP($I$19,Tablas!$A$155:$G$221,6,TRUE))))*1.1494","v":4179.1724240000003}]
[null,null,null,null,"Prima para hijo (s)",null,{"$f":"(IF($F$19=0,0,(VLOOKUP($F$19,Tablas!$A$222:$G$224,3,TRUE))))*1.1494","v":3673.4824000000003},{"$f":"(IF($F$19=0,0,(VLOOKUP($F$19,Tablas!$A$222:$G$224,4,TRUE))))*1.1494","v":3334.2714719999999},{"$f":"(IF($F$19=0,0,(VLOOKUP($F$19,Tablas!$A$222:$G$224,5,TRUE))))*1.1494","v":2537.0476320000002},{"$f":"(IF($F$19=0,0,(VLOOKUP($F$19,Tablas!$A$222:$G$224,6,TRUE))))*1.1494","v":1854.7178160000001}]
[null,null,null,null,"Total de Prima neta",null,{"$f":"(SUM(G28:G30))","v":18531.546320000001},{"$f":"(SUM(H28:H30))","v":16819.078248000002},{"$f":"(SUM(I28:I30))","v":12308.510816},{"$f":"(SUM(J28:J30))","v":8992.2159600000014}]
[null,null,null,null,"Costo Administrativo Anual",null,86,86,86,86]
[null,null,null,null," IVA (14.49%) ",null,{"$f":"(G32)*0%","v":0},{"$f":"(H32)*0%","v":0},{"$f":"(I32)*0%","v":0},{"$f":"(J32)*0%","v":0}]
[]
[null,null,null,null,"TOTAL ANUAL",null,{"$f":"SUM(G31:G33)","v":18617.546320000001},{"$f":"SUM(H31:H33)","v":16905.078248000002},{"$f":"SUM(I31:I33)","v":12394.510816},{"$f":"SUM(J31:J33)","v":9078.2159600000014}]
[]
[null,null,null,null,"Tarifas Semianuales"]
[null,null,null,null,"Prima para Asegurado Titular",null,{"$f":"(VLOOKUP($I$17,Tablas!$A$530:$G$596,3,TRUE))*1.1494","v":3220.3309902400006},{"$f":"(VLOOKUP($I$17,Tablas!$A$530:$G$596,4,TRUE))*1.1494","v":2922.4897268000004},{"$f":"(VLOOKUP($I$17,Tablas!$A$530:$G$596,5,TRUE))*1.1494","v":2146.6111643200002},{"$f":"(VLOOKUP($I$17,Tablas!$A$530:$G$596,6,TRUE))*1.1494","v":1567.9126316000002}]
[null,null,null,null,"Prima para conyuge",null,{"$f":"(IF($F$17=1,0,(VLOOKUP($I$19,Tablas!$A$530:$G$596,3,TRUE))))*1.1494","v":4654.4428873600009},{"$f":"(IF($F$17=1,0,(VLOOKUP($I$19,Tablas!$A$530:$G$596,4,TRUE))))*1.1494","v":4224.4578644800004},{"$f":"(IF($F$17=1,0,(VLOOKUP($I$19,Tablas!$A$530:$G$596,5,TRUE))))*1.1494","v":3032.2643232},{"$f":"(IF($F$17=1,0,(VLOOKUP($I$19,Tablas!$A$530:$G$596,6,TRUE))))*1.1494","v":2214.9613847199998}]
[null,null,null,null,"Prima para hijo (s)",null,{"$f":"(IF($F$19=0,0,(VLOOKUP($F$19,Tablas!$A$597:$G$599,3,TRUE))))*1.1494","v":1946.9456720000003},{"$f":"(IF($F$19=0,0,(VLOOKUP($F$19,Tablas!$A$597:$G$599,4,TRUE))))*1.1494","v":1767.16388016},{"$f":"(IF($F$19=0,0,(VLOOKUP($F$19,Tablas!$A$597:$G$599,5,TRUE))))*1.1494","v":1344.6352449600001},{"$f":"(IF($F$19=0,0,(VLOOKUP($F$19,Tablas!$A$597:$G$599,6,TRUE))))*1.1494","v":983.00044248000006}]
{"$rows_left_out":36}
{"sheet":"Global Select Health  Plan","index":2,"n_rows":74,"n_cols":10,"rows_kept":74,"cut":false,"hidden":false,"merged":[[73,4,74,9],[26,4,26,9],[36,4,36,9],[47,4,47,9],[60,4,60,9],[72,4,72,9],[64,4,64,5],[65,4,65,5],[57,0,57,1],[61,0,61,1],[72,0,72,1],[76,0,76,1],[86,0,86,1],[41,1,42,1],[41,0,42,0],[51,4,51,5],[52,4,52,5],[21,0,21,1],[35,0,35,1],[40,0,40,1],[12,3,12,4],[16,3,16,4],[12,5,12,8],[14,5,14,8],[12,0,12,1],[13,0,13,1],[14,0,14,1]]}
[null,null,null,null,null,null,null," "," "," "]
[]
[]
[]
[]
[]
[]
[]
[]
[]
[]
[]
["Global Select Health Plan",null,null,"Nombre del Asegurado Titular:",null,{"$f":"+'INGRESO DE DATOS'!$D$15","v":"JOHN DOE"}]
[]
[null,null,null,null,"Cotizado por:",{"$f":"+'INGRESO DE DATOS'!$D$21","v":"NOMBRE DEL AGENTE"}]
[]
[null,null,null,"Número de adultos en la póliza:",null,{"$f":"+'INGRESO DE DATOS'!$D$17","v":2},null,"Edad del Asegurado Titular:",{"$f":"+'INGRESO DE DATOS'!$D$19","v":32}]
[]
[null,null,null,null,"Número de niños en la póliza:",{"$f":"+'INGRESO DE DATOS'!$H$17","v":2},null,"Edad del/la conyuge:",{"$f":"+'INGRESO DE DATOS'!$H$19","v":46}]
[null,null,null,null,null,null,null," "," "]
[null,null,null,null,"Fecha de la cotización:",{"$f":"NOW()","v":"2023-04-17T12:29:16.010"}]
[]
[null,null,null,null,"Deducibles",null,"PLAN 1","PLAN 2","PLAN 3","PLAN 4"]
[null,null,null,null,"En el país de residencia",null,250,2000,5000,10000]
[null,null,null,null,"Fuera del país de residencia",null,5000,2000,5000,10000]
[]
[null,null,null,null,"Tarifas Anuales"]
[null,null,null,null,"Prima para Asegurado Titular",null,{"$f":"(VLOOKUP($I$17,Tablas!$A$305:$G$371,3,TRUE))*1.1494","v":4407.9030240000002},{"$f":"(VLOOKUP($I$17,Tablas!$A$305:$G$371,4,TRUE))*1.1494","v":4227.9529599999996},{"$f":"(VLOOKUP($I$17,Tablas!$A$305:$G$371,5,TRUE))*1.1494","v":3115.0579039999998},{"$f":"(VLOOKUP($I$17,Tablas!$A$305:$G$371,6,TRUE))*1.1494","v":2273.835032}]
[null,null,null,null,"Prima para conyuge",null,{"$f":"(IF($F$17=1,0,(VLOOKUP($I$19,Tablas!$A$305:$G$371,3,TRUE))))*1.1494","v":6616.222256},{"$f":"(IF($F$17=1,0,(VLOOKUP($I$19,Tablas!$A$305:$G$371,4,TRUE))))*1.1494","v":6347.1707040000001},{"$f":"(IF($F$17=1,0,(VLOOKUP($I$19,Tablas!$A$305:$G$371,5,TRUE))))*1.1494","v":4561.6467680000005},{"$f":"(IF($F$17=1,0,(VLOOKUP($I$19,Tablas!$A$305:$G$371,6,TRUE))))*1.1494","v":3332.5703600000002}]
[null,null,null,null,"Prima para hijo (s)",null,{"$f":"(IF($F$19=0,0,(VLOOKUP($F$19,Tablas!$A$372:$G$374,3,TRUE))))*1.1494","v":2870.465584},{"$f":"(IF($F$19=0,0,(VLOOKUP($F$19,Tablas!$A$372:$G$374,4,TRUE))))*1.1494","v":2754.284232},{"$f":"(IF($F$19=0,0,(VLOOKUP($F$19,Tablas!$A$372:$G$374,5,TRUE))))*1.1494","v":2109.6087600000001},{"$f":"(IF($F$19=0,0,(VLOOKUP($F$19,Tablas!$A$372:$G$374,6,TRUE))))*1.1494","v":1540.9316160000001}]
[null,null,null,null,"Total de Prima neta",null,{"$f":"(SUM(G28:G30))","v":13894.590864},{"$f":"(SUM(H28:H30))","v":13329.407895999999},{"$f":"(SUM(I28:I30))","v":9786.313431999999},{"$f":"(SUM(J28:J30))","v":7147.3370080000004}]
[null,null,null,null,"Costo Administrativo Anual",null,86,86,86,86]
[null,null,null,null,"  IVA (14.49%)  ",null,{"$f":"(G32)*0%","v":0},{"$f":"(H32)*0%","v":0},{"$f":"(I32)*0%","v":0},{"$f":"(J32)*0%","v":0}]
[]
[null,null,null,null,"TOTAL ANUAL",null,{"$f":"SUM(G31:G33)","v":13980.590864},{"$f":"SUM(H31:H33)","v":13415.407895999999},{"$f":"SUM(I31:I33)","v":9872.313431999999},{"$f":"SUM(J31:J33)","v":7233.3370080000004}]
[]
[null,null,null,null,"Tarifas Semianuales"]
[null,null,null,null,"Prima para Asegurado Titular",null,{"$f":"(VLOOKUP($I$17,Tablas!$A$605:$G$671,3,TRUE))*1.1494","v":2336.1886027199998},{"$f":"(VLOOKUP($I$17,Tablas!$A$605:$G$671,4,TRUE))*1.1494","v":2240.8150688000001},{"$f":"(VLOOKUP($I$17,Tablas!$A$605:$G$671,5,TRUE))*1.1494","v":1650.9806891200001},{"$f":"(VLOOKUP($I$17,Tablas!$A$605:$G$671,6,TRUE))*1.1494","v":1205.1325669599998}]
[null,null,null,null,"Prima para conyuge",null,{"$f":"(IF($F$17=1,0,(VLOOKUP($I$19,Tablas!$A$605:$G$671,3,TRUE))))*1.1494","v":3506.5977956800002},{"$f":"(IF($F$17=1,0,(VLOOKUP($I$19,Tablas!$A$605:$G$671,4,TRUE))))*1.1494","v":3364.0004731199997},{"$f":"(IF($F$17=1,0,(VLOOKUP($I$19,Tablas!$A$605:$G$671,5,TRUE))))*1.1494","v":2417.67278704},{"$f":"(IF($F$17=1,0,(VLOOKUP($I$19,Tablas!$A$605:$G$671,6,TRUE))))*1.1494","v":1766.2622908000001}]
[null,null,null,null,"Prima para hijo (s)",null,{"$f":"(IF($F$19=0,0,(VLOOKUP($F$19,Tablas!$A$672:$G$674,3,TRUE))))*1.1494","v":1521.3467595200002},{"$f":"(IF($F$19=0,0,(VLOOKUP($F$19,Tablas!$A$672:$G$674,4,TRUE))))*1.1494","v":1459.77064296},{"$f":"(IF($F$19=0,0,(VLOOKUP($F$19,Tablas!$A$672:$G$674,5,TRUE))))*1.1494","v":1118.0926428},{"$f":"(IF($F$19=0,0,(VLOOKUP($F$19,Tablas!$A$672:$G$674,6,TRUE))))*1.1494","v":816.69375648000005}]
{"$rows_left_out":35}
{"sheet":"Resumen tarifas","index":3,"n_rows":106,"n_cols":8,"rows_kept":106,"cut":false,"hidden":false,"merged":[[104,0,104,7],[70,4,70,7],[77,4,77,7],[79,4,79,7],[81,4,81,7],[83,4,83,7],[78,0,78,1],[91,0,91,1],[92,0,92,1],[74,1,74,3],[77,0,77,1],[101,0,101,3],[100,0,100,3],[64,4,64,7],[66,4,66,7],[68,4,68,7],[50,3,50,7],[52,3,52,7],[54,3,54,7],[22,2,22,6],[58,0,58,2],[53,0,53,1],[54,0,54,1],[55,0,55,1],[38,2,38,3],[40,2,40,3],[41,0,41,1],[27,0,27,1],[50,0,50,1],[51,0,51,1],[42,2,42,3],[52,0,52,1],[56,3,56,7],[105,0,107,6],[87,0,87,1],[90,0,90,1],[79,0,79,1],[86,0,86,2],[90,2,90,3],[82,0,82,1],[80,0,80,1],[81,0,81,1],[93,0,93,1],[102,0,102,1],[92,2,92,3],[94,2,94,3],[94,0,94,1],[95,0,95,1],[96,2,96,3],[19,0,19,6],[46,0,46,1],[21,2,21,6],[24,4,24,5],[27,4,27,5],[32,0,32,1],[33,0,33,1],[36,0,36,1],[37,0,37,1],[38,0,38,1],[39,0,39,1],[40,0,40,1],[44,0,44,1],[36,2,36,3],[21,0,21,1],[24,0,24,1],[61,0,61,1],[69,0,69,1],[64,0,64,1],[65,0,65,1],[66,0,66,1],[67,0,67,1],[68,0,68,1]]}
[]
[null,null,null,null," "," "]
[]
[]
[]
[null,null,null,null," "," "," "]
[]
[]
[]
[]
[]
[]
[]
[]
[]
[]
[]
[]
[]
["Cotización de Seguro Médico - Global Health Plans"]
[]
["Nombre del Asegurado Titular",null,{"$f":"+'INGRESO DE DATOS'!$D$15","v":"JOHN DOE"}]
[null,"Cotizado por",{"$f":"+'INGRESO DE DATOS'!$D$21","v":"NOMBRE DEL AGENTE"}]
[]
["Número de adultos en la póliza",null,{"$f":"+'INGRESO DE DATOS'!$D$17","v":2},null,"Edad del Asegurado Titular",null,{"$f":"+'INGRESO DE DATOS'!$D$19","v":32}]
[]
[]
["Número de niños en la póliza",null,{"$f":"+'INGRESO DE DATOS'!$H$17","v":2},null,"Edad del/la cónyuge ",null,{"$f":"+'INGRESO DE DATOS'!$H$19","v":46}]
[]
[]
[null,null,"Fecha de la Cotización:",{"$f":"NOW()","v":"2023-04-17T12:29:16.010"}]
[]
["Bupa Global Ultimtate Health Plan"]
["Deducibles",null,"PLAN 1","PLAN 2"]
["En el país de residencia",null,0,1000]
["Fuera del país de residencia",null,0,1000]
[null,null,"Tarifas Anuales"]
[null,null,{"$f":"#REF!","v":{"$error":"#REF!"}},{"$f":"#REF!","v":{"$error":"#REF!"}}]
[null,null,"Tarifas Semi-anuales"]
[null,null,{"$f":"#REF!","v":{"$error":"#REF!"}},{"$f":"#REF!","v":{"$error":"#REF!"}}]
{"$rows_left_out":67}
{"sheet":"Tablas","index":4,"n_rows":1497,"n_cols":25,"rows_kept":1497,"cut":false,"hidden":true,"merged":[[1424,0,1424,6],[1425,0,1425,1],[1425,2,1425,6],[1348,0,1348,6],[1349,0,1349,6],[1350,0,1350,1],[1350,2,1350,6],[1423,0,1423,6],[1200,0,1200,1],[1200,2,1200,6],[1273,0,1273,6],[1274,0,1274,6],[1275,0,1275,1],[1275,2,1275,6],[1124,0,1124,6],[1125,0,1125,6],[1126,0,1126,1],[1126,2,1126,6],[1199,0,1199,6],[976,0,976,1],[976,2,976,6],[1049,0,1049,6],[1050,0,1050,6],[1051,0,1051,1],[1051,2,1051,6],[900,0,900,6],[901,0,901,6],[902,0,902,1],[902,2,902,6],[975,0,975,6],[1,0,1,6],[2,0,2,6],[77,0,77,1],[77,2,77,6],[76,0,76,6],[3,0,3,1],[3,2,3,6],[376,0,376,1],[376,2,376,6],[150,0,150,6],[151,0,151,6],[152,0,152,1],[152,2,152,6],[225,0,225,6],[226,0,226,1],[375,0,375,6],[226,2,226,6],[300,0,300,6],[301,0,301,6],[302,0,302,1],[302,2,302,6],[526,0,526,6],[450,0,450,6],[451,0,451,6],[452,0,452,1],[452,2,452,6],[525,0,525,6],[527,0,527,1],[527,2,527,6],[600,0,600,6],[601,0,601,6],[602,0,602,1],[602,2,602,6],[751,0,751,6],[675,0,675,6],[676,0,676,6],[677,0,677,1],[677,2,677,6],[750,0,750,6],[752,0,752,1],[752,2,752,6],[825,0,825,6],[826,0,826,6],[827,0,827,1],[827,2,827,6]]}
[]
["BUPA GLOBAL ELITE",null,null,null,null,null,null,null,"FACTOR MENSUAL:",null,9.3333333333333338E-2,9.3333333333333338E-2,9.3333333333333338E-2,9.3333333333333338E-2,9.3333333333333338E-2,9.3333333333333338E-2]
["TARIFAS ANUALES",null,null,null,null,null,null,null,"FACTOR TRIMESTRAL:",null,0.27500000000000002,0.27500000000000002,0.27500000000000002,0.27500000000000002,0.27500000000000002,0.27500000000000002]
["EDAD",null,null,null,null,null,null,null,"FACTOR SEMIANUAL:",null,0.53,0.53,0.53,0.53,0.53,0.53]
[" "," ",250,2000,3500,5000,10000,null,null,null,null,null,null,null,null,null,null,null,null,null,2,6,10,14,18]
[18,18,{"$f":"O6","v":8460.0499999999993},{"$f":"P6","v":7413.7},{"$f":"Q6","v":6158.25},{"$f":"R6","v":5343.0999999999995},{"$f":"S6","v":4068.95},null,9953,8722,7245,6286,4787,null,{"$f":"(I6)*0.85","v":8460.0499999999993},{"$f":"(J6)*0.85","v":7413.7},6158.25,5343.0999999999995,4068.95,null,0,0,0,0,0]
[19,18,{"$f":"O7","v":8460.0499999999993},{"$f":"P7","v":7413.7},{"$f":"Q7","v":6158.25},{"$f":"R7","v":5343.0999999999995},{"$f":"S7","v":4068.95},null,9953,8722,7245,6286,4787,null,{"$f":"(I7)*0.85","v":8460.0499999999993},{"$f":"(J7)*0.85","v":7413.7},{"$f":"(K7)*0.85","v":6158.25},{"$f":"(L7)*0.85","v":5343.0999999999995},{"$f":"(M7)*0.85","v":4068.95},null,0,0,0,0,0]
[20,18,8460.0499999999993,7413.7,6158.25,5343.0999999999995,4068.95,null,9953,8722,7245,6286,4787,null,8460.0499999999993,7413.7,6158.25,5343.0999999999995,4068.95,null,0,0,0,0,0]
[21,18,8460.0499999999993,7413.7,6158.25,5343.0999999999995,4068.95,null,9953,8722,7245,6286,4787,null,8460.0499999999993,7413.7,6158.25,5343.0999999999995,4068.95,null,0,0,0,0,0]
[22,18,8460.0499999999993,7413.7,6158.25,5343.0999999999995,4068.95,null,9953,8722,7245,6286,4787,null,8460.0499999999993,7413.7,6158.25,5343.0999999999995,4068.95,null,0,0,0,0,0]
[23,18,8460.0499999999993,7413.7,6158.25,5343.0999999999995,4068.95,null,9953,8722,7245,6286,4787,null,8460.0499999999993,7413.7,6158.25,5343.0999999999995,4068.95,null,0,0,0,0,0]
[24,18,8460.0499999999993,7413.7,6158.25,5343.0999999999995,4068.95,null,9953,8722,7245,6286,4787,null,8460.0499999999993,7413.7,6158.25,5343.0999999999995,4068.95,null,0,0,0,0,0]
[25,25,9038.9,7922,6540.75,5671.2,4322.25,null,10634,9320,7695,6672,5085,null,9038.9,7922,6540.75,5671.2,4322.25,null,0,0,0,0,0]
[26,25,9038.9,7922,6540.75,5671.2,4322.25,null,10634,9320,7695,6672,5085,null,9038.9,7922,6540.75,5671.2,4322.25,null,0,0,0,0,0]
[27,25,9038.9,7922,6540.75,5671.2,4322.25,null,10634,9320,7695,6672,5085,null,9038.9,7922,6540.75,5671.2,4322.25,null,0,0,0,0,0]
[28,25,9038.9,7922,6540.75,5671.2,4322.25,null,10634,9320,7695,6672,5085,null,9038.9,7922,6540.75,5671.2,4322.25,null,0,0,0,0,0]
[29,25,9038.9,7922,6540.75,5671.2,4322.25,null,10634,9320,7695,6672,5085,null,9038.9,7922,6540.75,5671.2,4322.25,null,0,0,0,0,0]
[30,30,10051.25,8810.25,7219.9,6259.4,4767.6499999999996,null,11825,10365,8494,7364,5609,null,10051.25,8810.25,7219.9,6259.4,4767.6499999999996,null,0,0,0,0,0]
[31,30,10051.25,8810.25,7219.9,6259.4,4767.6499999999996,null,11825,10365,8494,7364,5609,null,10051.25,8810.25,7219.9,6259.4,4767.6499999999996,null,0,0,0,0,0]
[32,30,10051.25,8810.25,7219.9,6259.4,4767.6499999999996,null,11825,10365,8494,7364,5609,null,10051.25,8810.25,7219.9,6259.4,4767.6499999999996,null,0,0,0,0,0]
[33,30,10051.25,8810.25,7219.9,6259.4,4767.6499999999996,null,11825,10365,8494,7364,5609,null,10051.25,8810.25,7219.9,6259.4,4767.6499999999996,null,0,0,0,0,0]
[34,30,10051.25,8810.25,7219.9,6259.4,4767.6499999999996,null,11825,10365,8494,7364,5609,null,10051.25,8810.25,7219.9,6259.4,4767.6499999999996,null,0,0,0,0,0]
[35,35,11220,9831.9499999999989,8011.25,6947.9,5292.0999999999995,null,13200,11567,9425,8174,6226,null,11220,9831.9499999999989,8011.25,6947.9,5292.0999999999995,null,0,0,0,0,0]
[36,35,11220,9831.9499999999989,8011.25,6947.9,5292.0999999999995,null,13200,11567,9425,8174,6226,null,11220,9831.9499999999989,8011.25,6947.9,5292.0999999999995,null,0,0,0,0,0]
[37,35,11220,9831.9499999999989,8011.25,6947.9,5292.0999999999995,null,13200,11567,9425,8174,6226,null,11220,9831.9499999999989,8011.25,6947.9,5292.0999999999995,null,0,0,0,0,0]
[38,35,11220,9831.9499999999989,8011.25,6947.9,5292.0999999999995,null,13200,11567,9425,8174,6226,null,11220,9831.9499999999989,8011.25,6947.9,5292.0999999999995,null,0,0,0,0,0]
[39,35,11220,9831.9499999999989,8011.25,6947.9,5292.0999999999995,null,13200,11567,9425,8174,6226,null,11220,9831.9499999999989,8011.25,6947.9,5292.0999999999995,null,0,0,0,0,0]
[40,40,12985.449999999999,11380.65,9231,8004.45,6098.75,null,15277,13389,10860,9417,7175,null,12985.449999999999,11380.65,9231,8004.45,6098.75,null,0,0,0,0,0]
[41,40,12985.449999999999,11380.65,9231,8004.45,6098.75,null,15277,13389,10860,9417,7175,null,12985.449999999999,11380.65,9231,8004.45,6098.75,null,0,0,0,0,0]
[42,40,12985.449999999999,11380.65,9231,8004.45,6098.75,null,15277,13389,10860,9417,7175,null,12985.449999999999,11380.65,9231,8004.45,6098.75,null,0,0,0,0,0]
[43,40,12985.449999999999,11380.65,9231,8004.45,6098.75,null,15277,13389,10860,9417,7175,null,12985.449999999999,11380.65,9231,8004.45,6098.75,null,0,0,0,0,0]
[44,40,12985.449999999999,11380.65,9231,8004.45,6098.75,null,15277,13389,10860,9417,7175,null,12985.449999999999,11380.65,9231,8004.45,6098.75,null,0,0,0,0,0]
[45,45,14533.3,12737.25,10299.449999999999,8930.1,6801.7,null,17098,14985,12117,10506,8002,null,14533.3,12737.25,10299.449999999999,8930.1,6801.7,null,0,0,0,0,0]
[46,45,14533.3,12737.25,10299.449999999999,8930.1,6801.7,null,17098,14985,12117,10506,8002,null,14533.3,12737.25,10299.449999999999,8930.1,6801.7,null,0,0,0,0,0]
[47,45,14533.3,12737.25,10299.449999999999,8930.1,6801.7,null,17098,14985,12117,10506,8002,null,14533.3,12737.25,10299.449999999999,8930.1,6801.7,null,0,0,0,0,0]
[48,45,14533.3,12737.25,10299.449999999999,8930.1,6801.7,null,17098,14985,12117,10506,8002,null,14533.3,12737.25,10299.449999999999,8930.1,6801.7,null,0,0,0,0,0]
[49,45,14533.3,12737.25,10299.449999999999,8930.1,6801.7,null,17098,14985,12117,10506,8002,null,14533.3,12737.25,10299.449999999999,8930.1,6801.7,null,0,0,0,0,0]
[50,50,16796,14722.85,11876.199999999999,10299.449999999999,7844.65,null,19760,17321,13972,12117,9229,null,16796,14722.85,11876.199999999999,10299.449999999999,7844.65,null,0,0,0,0,0]
[51,50,16796,14722.85,11876.199999999999,10299.449999999999,7844.65,null,19760,17321,13972,12117,9229,null,16796,14722.85,11876.199999999999,10299.449999999999,7844.65,null,0,0,0,0,0]
[52,50,16796,14722.85,11876.199999999999,10299.449999999999,7844.65,null,19760,17321,13972,12117,9229,null,16796,14722.85,11876.199999999999,10299.449999999999,7844.65,null,0,0,0,0,0]
{"$rows_left_out":1457}