{"text_format":"1","workbook":"xlsx","n_sheets":5,"sheets":["INGRESO DE DATOS","Bupa Global Premier","Bupa Global Select","Resumen tarifas","Tablas"],"not_rendered":{"charts":0,"images":12,"macros":1,"external_links":0,"defined_names":0,"comments":1,"pivot_tables":0},"unopened":[],"bounds":{"document_bytes":16777216,"sheet_cells":100000,"rows_first":2000,"rows_last":500,"rows_between":2000,"halvings":0,"cell_chars":16384,"cell_head_chars":4096},"cells_cut":0,"cells_raw":0,"read":"whole","date_system":"1900"}

{"sheet":"INGRESO DE DATOS","index":0,"n_rows":44,"n_cols":9,"rows_kept":44,"cut":false,"hidden":false,"merged":[[41,3,41,4],[41,6,41,7],[10,0,10,12],[18,5,18,6],[14,1,14,2],[16,1,16,2],[14,3,14,7],[16,5,16,6],[18,1,18,2]]}
[]
[null,null,null,null,null,null,null," "," "]
[]
[]
[]
[null,null,null,null,null,null,null," "," "]
[]
[]
[]
[]
[]
[]
["1. LLENE LA INFORMACIÓN DEL ASEGURADO PROPUESTO:"]
[]
[null,"Nombre del Asegurado Titular",null,"NOMBRE DEL CLIENTE"]
[]
[null,"Número de adultos en la póliza",null,1,null,"Número de niños en la póliza",null,0]
[]
[null,"Edad del Asegurado Titular",null,29,null,"Edad del/la cónyuge ",null,46]
[]
[null,null,null,null,null,null,"Variante con coaseguro fuera del país de residencia",false]
[]
["2. SELECCIONE EL PRODUCTO PARA VER LA COTIZACIÓN CORRESPONDIENTE: "]
[]
[]
[]
[]
[]
[]
[]
[]
[]
[]
[]
[]
[]
[]
[]
[]
[]
{"$rows_left_out":5}
{"sheet":"Bupa Global Premier","index":1,"n_rows":85,"n_cols":10,"rows_kept":85,"cut":false,"hidden":false,"merged":[[20,0,20,9],[46,1,47,1],[46,0,47,0],[22,0,22,1],[28,5,28,6],[28,7,28,8],[22,3,22,4],[24,3,24,4],[26,3,26,4],[22,5,22,8],[39,4,39,5],[75,4,75,5],[77,4,77,5],[84,4,84,9],[50,4,50,5],[63,4,63,5],[76,4,76,5],[62,4,62,5],[64,4,64,5]]}
[]
[]
[null,null,null,null,null,null,null," "," "," "]
[]
[]
[]
[null,null,null,null,null,null,null," "," "," "]
[]
[]
[]
[]
[]
[]
[]
[]
[]
[]
[]
[]
[]
[]
[]
["Global Premier Health Plan",null,null,"Nombre del Asegurado Titular",null,{"$f":"+'INGRESO DE DATOS'!$D$15","v":"NOMBRE DEL CLIENTE"}]
[]
[null,null,null,"Número de adultos en la póliza",null,{"$f":"+'INGRESO DE DATOS'!$D$17","v":1},null,"Edad del Asegurado Titular",{"$f":"+'INGRESO DE DATOS'!$D$19","v":29}]
[]
[null,null,null,"Número de niños en la póliza",null,{"$f":"+'INGRESO DE DATOS'!$H$17","v":0},null,"Edad del/la conyuge",{"$f":"+'INGRESO DE DATOS'!$H$19","v":46}]
[null,null,null,null,null,null,null," "," "]
[null,null,null,null,null,"Fecha de la cotización ::",null,{"$f":"NOW()","v":"2023-03-27T16:19:20.400"}]
[null,null,null,null,null,null," ",false,null," "]
[null,null,null,null,"Deducibles",null,"PLAN 1","PLAN 2","PLAN 3","PLAN 4"]
[null,null,null,null,"En el país de residencia",null,2000,3500,5000,10000]
[null,null,null,null,"Fuera del país de residencia",null,2000,3500,5000,10000]
[]
[null,null,null,null,"Tarifas anuales"]
[null,null,null,null,"Prima para Asegurado Titular",null,{"$f":"VLOOKUP($I$25,Tablas!$A$155:$G$221,3,TRUE)","v":3872.96},{"$f":"VLOOKUP($I$25,Tablas!$A$155:$G$221,4,TRUE)","v":3233.04},{"$f":"VLOOKUP($I$25,Tablas!$A$155:$G$221,5,TRUE)","v":2772.48},{"$f":"VLOOKUP($I$25,Tablas!$A$155:$G$221,6,TRUE)","v":2062.64}]
[null,null,null,null,"Prima para conyuge",null,{"$f":"IF($F$25=1,0,(VLOOKUP($I$27,Tablas!$A$155:$G$221,3,TRUE)))","v":0},{"$f":"IF($F$25=1,0,(VLOOKUP($I$27,Tablas!$A$155:$G$221,4,TRUE)))","v":0},{"$f":"IF($F$25=1,0,(VLOOKUP($I$27,Tablas!$A$155:$G$221,5,TRUE)))","v":0},{"$f":"IF($F$25=1,0,(VLOOKUP($I$27,Tablas!$A$155:$G$221,6,TRUE)))","v":0}]
[null,null,null,null,"Prima para hijo (s)",null,{"$f":"IF($F$27=0,0,(VLOOKUP($F$27,Tablas!$A$222:$G$224,3,TRUE)))","v":0},{"$f":"IF($F$27=0,0,(VLOOKUP($F$27,Tablas!$A$222:$G$224,4,TRUE)))","v":0},{"$f":"IF($F$27=0,0,(VLOOKUP($F$27,Tablas!$A$222:$G$224,5,TRUE)))","v":0},{"$f":"IF($F$27=0,0,(VLOOKUP($F$27,Tablas!$A$222:$G$224,6,TRUE)))","v":0}]
[null,null,null,null,"Total de Prima neta",null,{"$f":"SUM(G36:G38)","v":3872.96},{"$f":"SUM(H36:H38)","v":3233.04},2772.48,2062.64]
[null,null,null,null,"Ajuste por la variante con coaseguro fuera\n del país de residencia",null,{"$f":"IF('INGRESO DE DATOS'!$H$21,G39*-15%,0)","v":0},{"$f":"IF('INGRESO DE DATOS'!$H$21,H39*-15%,0)","v":0},{"$f":"IF('INGRESO DE DATOS'!$H$21,I39*-15%,0)","v":0},{"$f":"IF('INGRESO DE DATOS'!$H$21,J39*-15%,0)","v":0}]
{"$rows_left_out":46}
{"sheet":"Bupa Global Select","index":2,"n_rows":85,"n_cols":10,"rows_kept":85,"cut":false,"hidden":false,"merged":[[50,4,50,5],[63,4,63,5],[76,4,76,5],[26,3,26,4],[46,1,47,1],[46,0,47,0],[20,0,20,9],[22,0,22,1],[28,5,28,6],[28,7,28,8],[22,3,22,4],[24,3,24,4],[22,5,22,8],[39,4,39,5],[84,4,84,9],[62,4,62,5],[64,4,64,5],[75,4,75,5],[77,4,77,5]]}
[]
[]
[null,null,null,null,null,null,null," "," "," "]
[]
[]
[]
[null,null,null,null,null,null,null," "," "," "]
[]
[]
[]
[]
[]
[]
[]
[]
[]
[]
[]
[]
[]
[]
[]
["Bupa Global Select Health Plan",null,null,"Nombre del Asegurado Titular",null,{"$f":"+'INGRESO DE DATOS'!$D$15","v":"NOMBRE DEL CLIENTE"}]
[]
[null,null,null,"Número de adultos en la póliza",null,{"$f":"+'INGRESO DE DATOS'!$D$17","v":1},null,"Edad del Asegurado Titular",{"$f":"+'INGRESO DE DATOS'!$D$19","v":29}]
[]
[null,null,null,"Número de niños en la póliza",null,{"$f":"+'INGRESO DE DATOS'!$H$17","v":0},null,"Edad del/la conyuge",{"$f":"+'INGRESO DE DATOS'!$H$19","v":46}]
[null,null,null,null,null,null,null," "," "]
[null,null,null,null,null,"Fecha de la cotización:",null,{"$f":"NOW()","v":"2023-03-27T16:19:20.400"}]
[null,null,null,null,null,null," ",false,null," "]
[null,null,null,null,"Deducibles",null,"PLAN 1","PLAN 2","PLAN 3","PLAN 4"]
[null,null,null,null,"En el país de residencia",null,2000,3500,5000,10000]
[null,null,null,null,"Fuera del país de residencia",null,2000,3500,5000,10000]
[]
[null,null,null,null,"Tarifas anuales"]
[null,null,null,null,"Prima para Asegurado Titular",null,{"$f":"VLOOKUP($I$25,Tablas!$A$305:$G$371,3,TRUE)","v":2669.12},{"$f":"VLOOKUP($I$25,Tablas!$A$305:$G$371,4,TRUE)","v":2233.64},{"$f":"VLOOKUP($I$25,Tablas!$A$305:$G$371,5,TRUE)","v":1997.28},{"$f":"VLOOKUP($I$25,Tablas!$A$305:$G$371,6,TRUE)","v":1485.8}]
[null,null,null,null,"Prima para conyuge",null,{"$f":"IF($F$25=1,0,(VLOOKUP($I$27,Tablas!$A$305:$G$371,3,TRUE)))","v":0},{"$f":"IF($F$25=1,0,(VLOOKUP($I$27,Tablas!$A$305:$G$371,4,TRUE)))","v":0},{"$f":"IF($F$25=1,0,(VLOOKUP($I$27,Tablas!$A$305:$G$371,5,TRUE)))","v":0},{"$f":"IF($F$25=1,0,(VLOOKUP($I$27,Tablas!$A$305:$G$371,6,TRUE)))","v":0}]
[null,null,null,null,"Prima para hijo (s)",null,{"$f":"IF($F$27=0,0,(VLOOKUP($F$27,Tablas!$A$372:$G$374,3,TRUE)))","v":0},{"$f":"IF($F$27=0,0,(VLOOKUP($F$27,Tablas!$A$372:$G$374,4,TRUE)))","v":0},{"$f":"IF($F$27=0,0,(VLOOKUP($F$27,Tablas!$A$372:$G$374,5,TRUE)))","v":0},{"$f":"IF($F$27=0,0,(VLOOKUP($F$27,Tablas!$A$372:$G$374,6,TRUE)))","v":0}]
[null,null,null,null,"Total de Prima neta",null,{"$f":"SUM(G36:G38)","v":2669.12},{"$f":"SUM(H36:H38)","v":2233.64},1997.28,1485.8]
[null,null,null,null,"Ajuste por la variante con coaseguro fuera\n del país de residencia",null,{"$f":"IF('INGRESO DE DATOS'!$H$21,G39*-15%,0)","v":0},{"$f":"IF('INGRESO DE DATOS'!$H$21,H39*-15%,0)","v":0},{"$f":"IF('INGRESO DE DATOS'!$H$21,I39*-15%,0)","v":0},{"$f":"IF('INGRESO DE DATOS'!$H$21,J39*-15%,0)","v":0}]
{"$rows_left_out":46}
{"sheet":"Resumen tarifas","index":3,"n_rows":100,"n_cols":8,"rows_kept":100,"cut":false,"hidden":false,"merged":[[18,0,18,1],[21,0,21,1],[24,0,24,1],[68,0,68,1],[55,0,55,2],[61,0,61,1],[62,0,62,1],[63,0,63,1],[58,0,58,3],[39,2,39,4],[53,0,53,1],[54,0,54,1],[47,0,47,1],[48,0,48,1],[49,0,49,1],[40,0,40,1],[16,0,16,6],[43,0,43,1],[18,2,18,6],[21,4,21,5],[24,4,24,5],[29,0,29,1],[30,0,30,1],[33,0,33,1],[33,2,33,4],[34,0,34,1],[35,0,35,1],[35,2,35,4],[36,0,36,1],[37,2,37,4],[38,0,38,1],[39,0,39,1],[75,0,75,1],[76,0,76,1],[66,0,66,1],[67,0,67,1],[74,0,74,1],[71,0,71,3],[99,0,99,6],[79,0,79,1],[80,0,80,1],[81,0,81,1],[77,0,77,1],[78,0,78,1],[90,0,90,1],[80,4,80,6],[84,0,84,1],[87,0,87,1],[97,0,97,1],[94,0,94,1],[83,0,83,2],[87,2,87,3],[89,2,89,3],[91,2,91,3],[41,0,41,1],[37,0,37,1],[64,0,64,1],[44,0,44,2],[65,0,65,1],[50,0,50,1],[51,0,51,1],[52,0,52,1],[93,2,93,3],[91,0,91,1],[92,0,92,1],[93,0,93,1],[88,0,88,1],[89,0,89,1],[47,3,47,5],[61,4,61,6],[74,4,74,6],[49,3,49,5],[63,4,63,6],[76,4,76,6],[51,3,51,5],[65,4,65,6],[78,4,78,6],[53,3,53,5],[67,4,67,6]]}
[]
[null,null,null,null," "," "]
[]
[]
[]
[null,null,null,null," "," "," "]
[]
[]
[]
[]
[]
[]
[]
[]
[]
[]
["Cotizador de Seguro Médico - Bupa Global Health Plans"]
[]
["Nombre del Asegurado Titular",null,{"$f":"+'INGRESO DE DATOS'!$D$15","v":"NOMBRE DEL CLIENTE"}]
[]
[]
["Número de adultos en la póliza",null,{"$f":"+'INGRESO DE DATOS'!$D$17","v":1},null,"Edad del Asegurado Titular",null,{"$f":"+'INGRESO DE DATOS'!$D$19","v":29}]
[]
[]
["Número de niños en la póliza",null,{"$f":"+'INGRESO DE DATOS'!$H$17","v":0},null,"Edad del/la cónyuge ",null,{"$f":"+'INGRESO DE DATOS'!$H$19","v":46}]
[]
[]
[null,null,null,"FECHA DE LA COTIZACIÓN :",{"$f":"NOW()","v":"2023-03-27T16:19:20.400"}]
[]
["Bupa Global Ultimtate Health Plan"]
["DEDUCIBLES",null,"PLAN 1","PLAN 2","PLAN 3"]
["En el país de residencia",null,0,1000,2000]
["Fuera del país de residencia",null,0,1000,2000]
[null,null,"Tarifas anuales"]
[null,null,{"$f":"#REF!","v":{"$error":"#REF!"}},{"$f":"#REF!","v":{"$error":"#REF!"}},{"$f":"#REF!","v":{"$error":"#REF!"}}]
[null,null,"Tarifas semi anuales"]
[null,null,{"$f":"#REF!","v":{"$error":"#REF!"}},{"$f":"#REF!","v":{"$error":"#REF!"}},{"$f":"#REF!","v":{"$error":"#REF!"}}]
[null,null,"Tarifas trimestrales"]
[null,null,{"$f":"#REF!","v":{"$error":"#REF!"}},{"$f":"#REF!","v":{"$error":"#REF!"}},{"$f":"#REF!","v":{"$error":"#REF!"}}]
[null,null,"Tarifas mensuales"]
{"$rows_left_out":61}
{"sheet":"Tablas","index":4,"n_rows":1497,"n_cols":19,"rows_kept":1497,"cut":false,"hidden":true,"merged":[[63,7,65,7],[752,0,752,1],[752,2,752,6],[825,0,825,6],[826,0,826,6],[527,0,527,1],[527,2,527,6],[600,0,600,6],[601,0,601,6],[602,0,602,1],[602,2,602,6],[526,0,526,6],[450,0,450,6],[451,0,451,6],[452,0,452,1],[452,2,452,6],[827,0,827,1],[827,2,827,6],[751,0,751,6],[675,0,675,6],[676,0,676,6],[677,0,677,1],[677,2,677,6],[750,0,750,6],[525,0,525,6],[376,0,376,1],[376,2,376,6],[150,0,150,6],[151,0,151,6],[152,0,152,1],[152,2,152,6],[225,0,225,6],[226,0,226,1],[375,0,375,6],[226,2,226,6],[300,0,300,6],[301,0,301,6],[302,0,302,1],[302,2,302,6],[1,0,1,6],[2,0,2,6],[77,0,77,1],[77,2,77,6],[76,0,76,6],[3,0,3,1],[3,2,3,6],[900,0,900,6],[901,0,901,6],[902,0,902,1],[902,2,902,6],[975,0,975,6],[976,0,976,1],[976,2,976,6],[1049,0,1049,6],[1050,0,1050,6],[1051,0,1051,1],[1051,2,1051,6],[1124,0,1124,6],[1125,0,1125,6],[1126,0,1126,1],[1126,2,1126,6],[1199,0,1199,6],[1200,0,1200,1],[1200,2,1200,6],[1273,0,1273,6],[1274,0,1274,6],[1275,0,1275,1],[1275,2,1275,6],[1424,0,1424,6],[1425,0,1425,1],[1425,2,1425,6],[1348,0,1348,6],[1349,0,1349,6],[1350,0,1350,1],[1350,2,1350,6],[1423,0,1423,6]]}
[]
["BUPA GLOBAL ELITE",null,null,null,null,null,null,null,"FACTOR MENSUAL:",null,9.3333333333333338E-2]
["TARIFAS ANUALES",null,null,null,null,null,null,null,"FACTOR TRIMESTRAL:",null,0.27500000000000002]
["EDAD",null,null,null,null,null,null,null,"FACTOR SEMIANUAL:",null,0.53]
[" "," ",1000,2000,3500,5000,10000]
[18,null,{"$f":"O6","v":6305.3},{"$f":"P6","v":4516.05},3824.15,3315.85,2572.1,null,7418,5313,4499,3901,3026,null,{"$f":"I6*0.85","v":6305.3},{"$f":"J6*0.85","v":4516.05},3824.15,3315.85,2572.1]
[19,null,{"$f":"O7","v":6388.5999999999995},{"$f":"P7","v":4570.45},{"$f":"Q7","v":3864.1},{"$f":"R7","v":3351.5499999999997},{"$f":"S7","v":2599.2999999999997},null,7516,5377,4546,3943,3058,null,{"$f":"I7*0.85","v":6388.5999999999995},4570.45,3864.1,3351.5499999999997,2599.2999999999997]
[20,null,6473.5999999999995,4628.25,3907.45,3388.1,2627.35,null,7616,5445,4597,3986,3091,null,6473.5999999999995,4628.25,3907.45,3388.1,2627.35]
[21,null,6561.15,4686.8999999999996,3951.65,3426.35,2657.1,null,7719,5514,4649,4031,3126,null,6561.15,4686.8999999999996,3951.65,3426.35,2657.1]
[22,null,6652.0999999999995,4748.0999999999995,3996.7,3465.45,2686.85,null,7826,5586,4702,4077,3161,null,6652.0999999999995,4748.0999999999995,3996.7,3465.45,2686.85]
[23,null,6748.15,4809.3,4045.15,3507.95,2720.85,null,7939,5658,4759,4127,3201,null,6748.15,4809.3,4045.15,3507.95,2720.85]
[24,null,6843.3499999999995,4874.75,4093.6,3549.6,2753.15,null,8051,5735,4816,4176,3239,null,6843.3499999999995,4874.75,4093.6,3549.6,2753.15]
[25,null,6942.8,4942.75,4143.75,3593.7999999999997,2787.15,null,8168,5815,4875,4228,3279,null,6942.8,4942.75,4143.75,3593.7999999999997,2787.15]
[26,null,7085.5999999999995,5039.6499999999996,4217.7,3658.4,2836.45,null,8336,5929,4962,4304,3337,null,7085.5999999999995,5039.6499999999996,4217.7,3658.4,2836.45]
[27,null,7234.3499999999995,5140.8,4295.8999999999996,3723.85,2889.15,null,8511,6048,5054,4381,3399,null,7234.3499999999995,5140.8,4295.8999999999996,3723.85,2889.15]
[28,null,7387.3499999999995,5244.5,4375.8,3794.4,2941.85,null,8691,6170,5148,4464,3461,null,7387.3499999999995,5244.5,4375.8,3794.4,2941.85]
[29,null,7548,5353.3,4459.95,3867.5,2999.65,null,8880,6298,5247,4550,3529,null,7548,5353.3,4459.95,3867.5,2999.65]
[30,null,7712.9,5468.05,4548.3499999999995,3944,3059.15,null,9074,6433,5351,4640,3599,null,7712.9,5468.05,4548.3499999999995,3944,3059.15]
[31,null,7883.75,5584.5,4640.1499999999996,4023.0499999999997,3121.2,null,9275,6570,5459,4733,3672,null,7883.75,5584.5,4640.1499999999996,4023.0499999999997,3121.2]
[32,null,8058.8499999999995,5706.05,4732.8,4103.8,3181.5499999999997,null,9481,6713,5568,4828,3743,null,8058.8499999999995,5706.05,4732.8,4103.8,3181.5499999999997]
[33,null,8239.9,5831,4831.3999999999996,4188.8,3249.5499999999997,null,9694,6860,5684,4928,3823,null,8239.9,5831,4831.3999999999996,4188.8,3249.5499999999997]
[34,null,8426.9,5960.2,4931.7,4276.3499999999995,3315.85,null,9914,7012,5802,5031,3901,null,8426.9,5960.2,4931.7,4276.3499999999995,3315.85]
[35,null,8617.2999999999993,6092.8,5037.0999999999995,4368.1499999999996,3388.1,null,10138,7168,5926,5139,3986,null,8617.2999999999993,6092.8,5037.0999999999995,4368.1499999999996,3388.1]
[36,null,8814.5,6229.65,5144.2,4459.95,3459.5,null,10370,7329,6052,5247,4070,null,8814.5,6229.65,5144.2,4459.95,3459.5]
[37,null,9017.65,6372.45,5254.7,4557.7,3534.2999999999997,null,10609,7497,6182,5362,4158,null,9017.65,6372.45,5254.7,4557.7,3534.2999999999997]
[38,null,9225.0499999999993,6516.0999999999995,5369.45,4657.1499999999996,3611.65,null,10853,7666,6317,5479,4249,null,9225.0499999999993,6516.0999999999995,5369.45,4657.1499999999996,3611.65]
[39,null,9439.25,6666.55,5487.5999999999995,4758.3,3689.85,null,11105,7843,6456,5598,4341,null,9439.25,6666.55,5487.5999999999995,4758.3,3689.85]
[40,null,9657.6999999999989,6819.55,5608.3,4862.8499999999995,3772.2999999999997,null,11362,8023,6598,5721,4438,null,9657.6999999999989,6819.55,5608.3,4862.8499999999995,3772.2999999999997]
[41,null,9882.1,6976.8,5733.25,4971.6499999999996,3856.45,null,11626,8208,6745,5849,4537,null,9882.1,6976.8,5733.25,4971.6499999999996,3856.45]
[42,null,10110.75,7137.45,5861.5999999999995,5082.1499999999996,3942.2999999999997,null,11895,8397,6896,5979,4638,null,10110.75,7137.45,5861.5999999999995,5082.1499999999996,3942.2999999999997]
[43,null,10344.5,7304.05,5993.3499999999995,5196.8999999999996,4030.7,null,12170,8593,7051,6114,4742,null,10344.5,7304.05,5993.3499999999995,5196.8999999999996,4030.7]
[44,null,10585.05,7471.5,6126.8,5313.3499999999995,4121.6499999999996,null,12453,8790,7208,6251,4849,null,10585.05,7471.5,6126.8,5313.3499999999995,4121.6499999999996]
[45,null,10830.699999999999,7645.75,6266.2,5432.3499999999995,4213.45,null,12742,8995,7372,6391,4957,null,10830.699999999999,7645.75,6266.2,5432.3499999999995,4213.45]
[46,null,11081.449999999999,7822.55,6408.15,5557.3,4308.6499999999996,null,13037,9203,7539,6538,5069,null,11081.449999999999,7822.55,6408.15,5557.3,4308.6499999999996]
[47,null,11337.3,8005.3,6551.8,5680.55,4406.3999999999996,null,13338,9418,7708,6683,5184,null,11337.3,8005.3,6551.8,5680.55,4406.3999999999996]
[48,null,11599.1,8188.9,6699.7,5808.9,4505,null,13646,9634,7882,6834,5300,null,11599.1,8188.9,6699.7,5808.9,4505]
[49,null,11866.85,8379.2999999999993,6851.8499999999995,5941.5,4607,null,13961,9858,8061,6990,5420,null,11866.85,8379.2999999999993,6851.8499999999995,5941.5,4607]
[50,null,12138,8571.4,7007.4,6076.65,4712.3999999999996,null,14280,10084,8244,7149,5544,null,12138,8571.4,7007.4,6076.65,4712.3999999999996]
[51,null,12415.949999999999,8768.6,7167.2,6214.3499999999995,4818.6499999999996,null,14607,10316,8432,7311,5669,null,12415.949999999999,8768.6,7167.2,6214.3499999999995,4818.6499999999996]
[52,null,12698.15,8970.0499999999993,7326.15,6352.05,4927.45,null,14939,10553,8619,7473,5797,null,12698.15,8970.0499999999993,7326.15,6352.05,4927.45]
{"$rows_left_out":1457}