{"text_format":"1","workbook":"xlsx","n_sheets":8,"sheets":["INGRESO DE DATOS","Global Ultimate","Global Elite","Global Premier","Global Select","Global Major Medical","Resumen Tarifas","Tablas"],"not_rendered":{"charts":0,"images":18,"macros":1,"external_links":0,"defined_names":6,"comments":1,"pivot_tables":0},"unopened":[],"bounds":{"document_bytes":16777216,"sheet_cells":100000,"rows_first":2000,"rows_last":500,"rows_between":2000,"halvings":0,"cell_chars":16384,"cell_head_chars":4096},"cells_cut":0,"cells_raw":0,"read":"whole","date_system":"1900"}

{"sheet":"INGRESO DE DATOS","index":0,"n_rows":47,"n_cols":25,"rows_kept":47,"cut":false,"hidden":false,"merged":[[43,11,46,12],[44,14,44,18],[55,3,55,4],[55,6,55,7],[44,0,44,1],[38,0,38,1],[40,0,40,1],[42,0,42,1],[10,18,17,18],[41,7,41,9],[38,4,40,5],[41,4,41,5],[38,7,40,9],[41,14,41,16],[25,14,25,18],[21,20,21,24],[10,14,10,16],[36,2,36,12],[21,14,21,18],[36,14,36,18],[10,0,10,12],[14,10,14,12],[36,0,36,1],[31,20,31,24]]}
[]
[null,null,null,null,null,null,null," "," ",null,null,null,null,null,"24 years",false]
[null,null,null,null,null,null,null,null,null,null,null,null,null,null,"Coaseguro (Panamá)",false]
[]
[]
[null,null,null,null,null,null,null," "," "]
[]
[]
[]
[]
[null,null,null,null,null,null,null,null,null,null,null,null,null,null,"Descuento 24 años (por edad)",null,null,null,"Type","Nuevo Negocio"]
[null,null,null,null,null,null,null,null,null,null,null,null,null,null,"age","Discount (%)","Parameter",null,null,"Renovación"]
[null,null,null,null,null,null,null,null,null,null,null,null,null,null,24,35,{"$f":"1-P13/100","v":0.65},null,null,"Renovación: 2020"]
[null,null,null,null,null,null,null,null,null,null,null,null,null,null,25,30,{"$f":"1-P14/100","v":0.7},null,null,"Renovación: Pólizas mayo - diciembre de 2024"]
[null,null,null,null,null,null,null,null,null,null,null,null,null,null,26,25,0.75,null,null,"Renovación: Pólizas 2025"]
[null,null,null,null,null,null,null,null,null,null,null,null,null,null,27,20,0.8]
[null,null,null,null,null,null,null,null,null,null,null,null,null,null,28,15,0.85]
[null,null,null,null,null,null,null,null,null,null,null,null,null,null,29,6,0.94]
[null,null,null,null,null,null,null,null,null,null,null,null,null,null,"All ages",0,1,null,"Type selected",1]
[]
[null,null,null,null,null,null,null,false,null,null,null,null,null,null,null,null,"Renovaciòn: promoción  enero - diciembre 2025"]
[null,null,null,null,null,null,null,null,null,null,null,null,null,null,"NEW BUSINESS DISCOUNT (ENTRADA MANUAL)",null,null,null,null,null,"POLIZAS 2020 (ENTRADA MANUAL)"]
[null,null,null,null,null,null,null,null,null,null,null,null,null,null,"Ultimate","Elite","Premier","Select","Major Medical",null,"Ultimate","Elite","Premier","Select","Major Medical"]
[null,null,null,null,null,null,null,null,null,null,null,null,null,null,0,15,25,15,15,null,0,15,15,15,15]
[]
[null,null,null,null,null,null,null,null,null,null,null,null,null,null,"Renovación: Pólizas mayo - diciembre de 2024"]
[null,null,null,null,null,null,null,null,null,null,null,null,null,null,"Ultimate","Elite","Premier","Select","Major Medical"]
[null,null,null,null,null,null,null,null,null,null,null,null,null,null,0,0,15,15,0]
[]
[null,null,null,null,null,null,null,null,null,null,null,null,null,null,"Descuento de 24 años:",{"$f":"IF(P2,_xlfn.SWITCH(C43,O13,Q13,O14,Q14,O15,Q15,O16,Q16,O17,Q17,O18,Q18,Q19),Q19)","v":1},null,"IVA (12%)",{"$f":"12/100","v":0.12},{"$f":"S30+1","v":1.1200000000000001}]
{"$rows_left_out":18}
{"sheet":"Global Ultimate","index":1,"n_rows":80,"n_cols":22,"rows_kept":80,"cut":false,"hidden":false,"merged":[[16,2,16,3],[79,0,82,3],[30,0,30,1],[4,0,10,4],[12,1,12,4],[22,1,22,2],[23,0,23,4],[26,0,26,1],[27,0,27,1],[29,0,29,4],[43,0,43,1],[31,0,31,1],[32,0,32,1],[33,0,33,1],[34,0,34,1],[35,0,35,1],[36,0,36,1],[61,0,61,1],[62,0,62,1],[37,0,37,1],[38,0,38,1],[40,0,40,4],[41,0,41,1],[42,0,42,1],[0,7,0,12],[0,14,0,19],[68,0,68,1],[69,0,69,1],[56,0,56,1],[44,0,44,1],[45,0,45,1],[46,0,46,1],[47,0,47,1],[48,0,48,1],[49,0,49,1],[50,0,50,1],[51,0,51,1],[53,0,53,4],[54,0,54,1],[55,0,55,1],[0,21,0,26],[77,0,77,1],[71,0,71,1],[72,0,72,1],[73,0,73,1],[74,0,74,1],[75,0,75,1],[76,0,76,1],[70,0,70,1],[57,0,57,1],[58,0,58,1],[59,0,59,1],[60,0,60,1],[63,0,63,1],[66,0,66,4],[67,0,67,1]]}
[null,null,false,null,null,null,null,"RESUMEN DE BENEFICIOS",null,null,null,null,null,null,"RESUMEN DE BENEFICIOS",null,null,null,null,null,null,"RESUMEN DE BENEFICIOS"]
[]
[]
[]
["Cotización de Seguro Médico Internacional\nGlobal Ultimate Health Plan\nTarifas en US$ | Validas: 1 de enero de 2026"]
[]
[]
[]
[]
[]
[]
[]
["Nombre del Asegurado Titular",{"$f":"+'INGRESO DE DATOS'!$C$37","v":"John Doe"}]
[]
["Número de adultos en la póliza",{"$f":"+'INGRESO DE DATOS'!$C$41","v":2}]
[]
["Número de Dependientes en la póliza",{"$f":"+'INGRESO DE DATOS'!$C$39","v":2},{"$f":"IF('INGRESO DE DATOS'!$P$2=TRUE, \"Cotización para dependiente de 24 años\",\"\")","v":""}]
[]
["Número de Dependientes menores de 16 años",{"$f":"+'INGRESO DE DATOS'!$E$42","v":1}]
[]
["Edad del Asegurado Titular",{"$f":"+'INGRESO DE DATOS'!$C$43","v":32},"Edad del/la conyuge",{"$f":"+'INGRESO DE DATOS'!$C$45","v":46}]
[]
["Fecha de la cotización",{"$f":"NOW()","v":"2026-01-12T09:32:49.510"}]
[]
[]
["DEDUCIBLES",null,"PLAN 1","PLAN 2","PLAN 3"]
["En el país de residencia",null,"$0",1000,2000]
["Fuera del país de residencia",null,"$0",1000,2000]
[]
["TARIFAS ANUALES"]
{"$rows_left_out":51}
{"sheet":"Global Elite","index":2,"n_rows":85,"n_cols":25,"rows_kept":85,"cut":false,"hidden":false,"merged":[[78,0,78,1],[79,0,79,1],[80,0,80,1],[81,0,81,1],[82,0,82,1],[76,0,76,1],[77,0,77,1],[59,0,59,1],[63,0,63,1],[64,0,64,1],[71,0,71,1],[72,0,72,1],[73,0,73,1],[68,0,68,1],[67,0,67,1],[66,0,66,1],[65,0,65,1],[62,0,62,1],[56,0,56,7],[70,0,70,7],[60,0,60,1],[24,0,24,1],[75,0,75,1],[40,0,40,1],[54,0,54,1],[53,0,53,1],[52,0,52,1],[51,0,51,1],[46,0,46,1],[47,0,47,1],[48,0,48,1],[49,0,49,1],[0,17,0,22],[0,24,0,29],[34,0,34,1],[12,1,12,6],[20,4,20,5],[22,1,22,3],[27,0,27,1],[28,0,28,1],[31,0,31,1],[32,0,32,1],[33,0,33,1],[16,2,16,3],[4,0,10,7],[30,0,30,7],[84,0,88,7],[0,10,0,15],[39,0,39,1],[45,0,45,1],[57,0,57,1],[35,0,35,1],[36,0,36,1],[42,0,42,6],[43,0,43,1],[44,0,44,1],[37,0,37,1],[38,0,38,1],[58,0,58,1],[61,0,61,1],[74,0,74,1],[50,0,50,1]]}
[null,null,null,null,null,null,null,null,null,null,"RESUMEN DE BENEFICIOS",null,null,null,null,null,null,"RESUMEN DE BENEFICIOS",null,null,null,null,null,null,"RESUMEN DE BENEFICIOS"]
[]
[]
[]
["Cotización de Seguro Médico Internacional\nGlobal Elite Health Plan\nTarifas en US$ | Validas: 1 de enero de 2026"]
[]
[]
[]
[]
[]
[]
[]
["Nombre del Asegurado Titular",{"$f":"+'INGRESO DE DATOS'!$C$37","v":"John Doe"}]
[]
["Número de adultos en la póliza",{"$f":"+'INGRESO DE DATOS'!$C$39","v":2}]
[]
["Número de Dependientes en la póliza",{"$f":"+'INGRESO DE DATOS'!$C$41","v":2},{"$f":"IF('INGRESO DE DATOS'!$P$2=TRUE, \"Cotización para dependiente de 24 años\",\"\")","v":""}]
[]
["Número de Dependientes menores de 10 años",{"$f":"+'INGRESO DE DATOS'!$H$42","v":1}]
[]
["Edad del Asegurado Titular",{"$f":"+'INGRESO DE DATOS'!$C$43","v":32},null,null,"Edad del/la conyuge",null,{"$f":"+'INGRESO DE DATOS'!$C$45","v":46}]
[]
["Fecha de la cotización",{"$f":"NOW()","v":"2026-01-12T09:32:49.510"}]
[]
[{"$f":"IF('INGRESO DE DATOS'!P3=TRUE,\"Variante con coaseguro fuera del país de residencia: SI\",\"Variante con coaseguro fuera del país de residencia: NO\")","v":"Variante con coaseguro fuera del país de residencia: NO"}]
[]
["DEDUCIBlES",null,"PLAN 1","PLAN 2","PLAN 3","PLAN 4","PLAN 5","PLAN 6"]
["En el país de residencia",null,250,2000,3500,5000,10000,20000]
["Fuera del país de residencia",null,5000,2000,3500,5000,10000,20000]
[]
{"$rows_left_out":56}
{"sheet":"Global Premier","index":3,"n_rows":79,"n_cols":24,"rows_kept":79,"cut":false,"hidden":false,"merged":[[73,0,73,1],[22,0,22,2],[78,0,81,5],[65,0,65,5],[66,0,66,1],[67,0,67,1],[68,0,68,1],[72,0,72,1],[39,0,39,5],[40,0,40,1],[41,0,41,1],[42,0,42,1],[45,0,45,1],[30,0,30,1],[31,0,31,1],[34,0,34,1],[35,0,35,1],[36,0,36,1],[0,0,3,5],[12,1,12,5],[18,3,18,4],[16,2,16,3],[69,0,69,1],[71,0,71,1],[44,0,44,1],[57,0,57,1],[70,0,70,1],[56,0,56,1],[58,0,58,1],[46,0,46,1],[47,0,47,1],[52,0,52,5],[53,0,53,1],[54,0,54,1],[55,0,55,1],[59,0,59,1],[60,0,60,1],[0,9,0,14],[0,16,0,21],[0,23,0,28],[33,0,33,1],[20,1,20,2],[25,0,25,1],[26,0,26,1],[28,0,28,5],[29,0,29,1],[4,0,10,6]]}
[" ",null,null,null,null,null,null,null,null,"RESUMEN DE BENEFICIOS",null,null,null,null,null,null,"RESUMEN DE BENEFICIOS",null,null,null,null,null,null,"RESUMEN DE BENEFICIOS"]
[]
[]
[]
["Cotización de Seguro Médico Internacional\nGlobal Premier Health Plan\nTarifas en US$ | Validas: 1 de enero de 2026"]
[]
[]
[]
[]
[]
[]
[]
["Nombre del Asegurado Titular",{"$f":"+'INGRESO DE DATOS'!$C$37","v":"John Doe"}]
[]
["Número de adultos en la póliza",{"$f":"+'INGRESO DE DATOS'!$C$39","v":2}]
[]
["Número de Dependientes en la póliza",{"$f":"+'INGRESO DE DATOS'!$C$41","v":2},{"$f":"IF('INGRESO DE DATOS'!$P$2=TRUE, \"Cotización para dependiente de 24 años\",\"\")","v":""}]
[]
["Edad del Asegurado Titular",{"$f":"+'INGRESO DE DATOS'!$C$43","v":32},null,"Edad del/la conyuge",null,{"$f":"+'INGRESO DE DATOS'!$C$45","v":46}]
[]
["Fecha de la cotización",{"$f":"NOW()","v":"2026-01-12T09:32:49.510"}]
[]
[{"$f":"IF('INGRESO DE DATOS'!P3=TRUE,\"Variante con coaseguro fuera del país de residencia: SI\",\"Variante con coaseguro fuera del país de residencia: NO\")","v":"Variante con coaseguro fuera del país de residencia: NO"}]
[null,null," ",null,null," "]
["Deducibles",null,"PLAN 1","PLAN 2","PLAN 3","PLAN 4","PLAN 5"]
["En el país de residencia",null,250,2000,5000,10000,20000]
["Fuera del país de residencia",null,5000,2000,5000,10000,20000]
[]
["TARIFAS ANUALES"]
["Prima para Asegurado Titular",null,{"$f":"VLOOKUP($B$19,Tablas!$A$156:$G$222,3,TRUE)","v":6861.75},{"$f":"VLOOKUP($B$19,Tablas!$A$156:$G$222,4,TRUE)","v":6228.75},{"$f":"VLOOKUP($B$19,Tablas!$A$156:$G$222,5,TRUE)","v":4493.25},{"$f":"VLOOKUP($B$19,Tablas!$A$156:$G$222,6,TRUE)","v":3254.25},{"$f":"VLOOKUP($B$19,Tablas!$A$156:$G$222,7,TRUE)","v":2561.25}]
{"$rows_left_out":50}
{"sheet":"Global Select","index":4,"n_rows":79,"n_cols":17,"rows_kept":79,"cut":false,"hidden":false,"merged":[[16,2,16,3],[78,0,81,5],[40,0,40,1],[41,0,41,1],[42,0,42,1],[45,0,45,1],[46,0,46,1],[58,0,58,1],[69,0,69,1],[71,0,71,1],[59,0,59,1],[60,0,60,1],[65,0,65,5],[66,0,66,1],[67,0,67,1],[68,0,68,1],[74,0,74,1],[75,0,75,1],[76,0,76,1],[44,0,44,1],[57,0,57,1],[70,0,70,1],[47,0,47,1],[48,0,48,1],[49,0,49,1],[50,0,50,1],[52,0,52,5],[53,0,53,1],[54,0,54,1],[55,0,55,1],[56,0,56,1],[63,0,63,1],[31,0,31,1],[73,0,73,1],[34,0,34,1],[35,0,35,1],[36,0,36,1],[37,0,37,1],[39,0,39,5],[72,0,72,1],[0,9,0,14],[0,16,0,21],[0,23,0,28],[61,0,61,1],[62,0,62,1],[4,0,10,5],[20,1,20,2],[12,1,12,5],[18,3,18,4],[22,0,22,2],[25,0,25,1],[26,0,26,1],[28,0,28,5],[29,0,29,1],[33,0,33,1],[30,0,30,1]]}
[" ",null,null,null,null,null,null,null,null,"RESUMEN DE BENEFICIOS",null,null,null,null,null,null,"RESUMEN DE BENEFICIOS"]
[]
[]
[]
["Cotización de Seguro Médico Internacional\nGlobal Select Health Plan\nTarifas en US$ | Validas: 1 de enero de 2026"]
[]
[]
[]
[]
[]
[]
[]
["Nombre del Asegurado Titular",{"$f":"+'INGRESO DE DATOS'!$C$37","v":"John Doe"}]
[]
["Número de adultos en la póliza",{"$f":"+'INGRESO DE DATOS'!$C$39","v":2}]
[]
["Número de Dependientes en la póliza",{"$f":"+'INGRESO DE DATOS'!$C$41","v":2},{"$f":"IF('INGRESO DE DATOS'!$P$2=TRUE, \"Cotización para dependiente de 24 años\",\"\")","v":""}]
[]
["Edad del Asegurado Titular",{"$f":"+'INGRESO DE DATOS'!$C$43","v":32},null,"Edad del/la conyuge",null,{"$f":"+'INGRESO DE DATOS'!$C$45","v":46}]
[]
["Fecha de la cotización",{"$f":"NOW()","v":"2026-01-12T09:32:49.510"}]
[]
[{"$f":"IF('INGRESO DE DATOS'!P3=TRUE,\"Variante con coaseguro fuera del país de residencia: SI\",\"Variante con coaseguro fuera del país de residencia: NO\")","v":"Variante con coaseguro fuera del país de residencia: NO"}]
[]
["DEDUCIBLES",null,"PLAN 1","PLAN 2","PLAN 3","PLAN 4","PLAN 5"]
["En el país de residencia",null,250,2000,5000,10000,20000]
["Fuera del país de residencia",null,5000,2000,5000,10000,20000]
[]
["TARIFAS ANUALES"]
["Prima para Asegurado Titular",null,{"$f":"VLOOKUP($B$19,Tablas!$A$307:$G$373,3,TRUE)","v":6718.4},{"$f":"VLOOKUP($B$19,Tablas!$A$307:$G$373,4,TRUE)","v":6447.25},{"$f":"VLOOKUP($B$19,Tablas!$A$307:$G$373,5,TRUE)","v":4671.5999999999995},{"$f":"VLOOKUP($B$19,Tablas!$A$307:$G$373,6,TRUE)","v":3385.5499999999997},{"$f":"VLOOKUP($B$19,Tablas!$A$307:$G$373,7,TRUE)","v":2708.95}]
{"$rows_left_out":50}
{"sheet":"Global Major Medical","index":5,"n_rows":73,"n_cols":14,"rows_kept":73,"cut":false,"hidden":false,"merged":[[50,0,50,1],[51,0,51,1],[54,0,54,1],[55,0,55,1],[60,0,60,3],[72,0,77,3],[68,0,68,1],[69,0,69,1],[70,0,70,1],[61,0,61,1],[62,0,62,1],[63,0,63,1],[66,0,66,1],[67,0,67,1],[64,0,64,1],[65,0,65,1],[45,0,45,1],[46,0,46,1],[49,0,49,1],[0,6,0,11],[39,0,39,1],[41,0,41,1],[42,0,42,1],[43,0,43,1],[44,0,44,1],[33,0,33,1],[34,0,34,1],[36,0,36,3],[37,0,37,1],[38,0,38,1],[16,2,16,3],[0,13,0,18],[26,0,26,3],[52,0,52,1],[53,0,53,1],[27,0,27,1],[28,0,28,1],[29,0,29,1],[31,0,31,1],[0,0,3,3],[4,0,10,3],[12,1,12,3],[23,0,23,1],[24,0,24,1],[20,1,20,2],[32,0,32,1],[48,0,48,3]]}
[" ",null,null,null,null,null,"RESUMEN DE BENEFICIOS",null,null,null,null,null,null,"RESUMEN DE BENEFICIOS"]
[]
[null,null,null,null," "]
[]
[" Cotización de Seguro Médico Internacional\nGlobal Major Medical\nHealth Plan\nTarifas en US$ | Validas: 1 de enero de 2026"]
[]
[null,null,null,null," "]
[]
[]
[]
[]
[]
["Nombre del Asegurado Titular",{"$f":"+'INGRESO DE DATOS'!$C$37","v":"John Doe"}]
[]
["Número de adultos en la póliza",{"$f":"+'INGRESO DE DATOS'!$C$39","v":2}]
[]
["Número de Dependientes en la póliza",{"$f":"+'INGRESO DE DATOS'!$C$41","v":2},{"$f":"IF('INGRESO DE DATOS'!$P$2=TRUE, \"Cotización para dependiente de 24 años\",\"\")","v":""}]
[]
["Edad del Asegurado Titular",{"$f":"+'INGRESO DE DATOS'!$C$43","v":32},"Edad del/la conyuge",{"$f":"+'INGRESO DE DATOS'!$C$45","v":46}]
[]
["Fecha de la cotización",{"$f":"NOW()","v":"2026-01-12T09:32:49.510"}]
[]
["DEDUCIBLeS",null,"PLAN 1","PLAN 2"]
["En el país de residencia",null,10000,20000]
["Fuera del país de residencia",null,10000,20000]
[]
["TARIFAS ANUALES"]
["Prima para Asegurado Titular",null,{"$f":"VLOOKUP($B$19,Tablas!$A$1138:$G$1204,3,TRUE)","v":4346.05},{"$f":"VLOOKUP($B$19,Tablas!$A$1138:$G$1204,4,TRUE)","v":3309.9}]
["Prima para conyuge",null,{"$f":"IF($B$15=1,0,(VLOOKUP($D$19,Tablas!$A$1138:$G$1204,3,TRUE)))","v":5974.65},{"$f":"IF($B$15=1,0,(VLOOKUP($D$19,Tablas!$A$1138:$G$1204,4,TRUE)))","v":4530.5}]
["Prima para hijo (s)",null,{"$f":"IF($B$17=0,0,(VLOOKUP($B$17,Tablas!$A$1205:$G$1207,3,TRUE)))","v":2618},{"$f":"IF($B$17=0,0,(VLOOKUP($B$17,Tablas!$A$1205:$G$1207,4,TRUE)))","v":2056.15}]
{"$rows_left_out":44}
{"sheet":"Resumen Tarifas","index":6,"n_rows":90,"n_cols":7,"rows_kept":90,"cut":false,"hidden":false,"merged":[[0,0,3,6],[4,0,10,6],[12,1,12,6],[89,0,96,6],[71,1,71,5],[73,1,73,5],[54,1,54,5],[56,1,56,5],[58,1,58,5],[60,1,60,5],[63,0,63,5],[16,2,16,3],[22,0,22,2],[20,1,20,2],[40,0,47,0],[54,0,61,0],[22,4,34,5],[76,3,87,5],[26,0,33,0],[26,1,26,2],[28,1,28,2],[30,1,30,2],[32,1,32,2],[50,0,50,5],[40,1,40,6],[42,1,42,6],[44,1,44,6],[46,1,46,6],[36,0,36,6],[86,1,86,2],[76,0,76,2],[82,1,82,2],[84,1,84,2],[80,1,80,2],[67,1,67,5],[69,1,69,5],[67,0,74,0],[80,0,87,0]]}
[" "]
[]
[]
[]
["Cotización de Seguro Médico Internacional\nBupa Global Major Health Plans\nResumen de Tarifas\nTarifas en US$ | Validas: 1 de enero de 2026"]
[]
[]
[]
[]
[]
[]
[]
["Nombre del Asegurado Titular",{"$f":"+'INGRESO DE DATOS'!$C$37","v":"John Doe"}]
[]
["Número de adultos en la póliza",{"$f":"+'INGRESO DE DATOS'!$C$39","v":2}]
[]
["Número de Dependientes en la póliza",{"$f":"+'INGRESO DE DATOS'!$C$41","v":2},{"$f":"IF('INGRESO DE DATOS'!$P$2=TRUE, \"Cotización para dependiente de 24 años\",\"\")","v":""}]
[]
["Edad del Asegurado Titular",{"$f":"+'INGRESO DE DATOS'!$C$43","v":32},null,null,null,"Edad del/la conyuge",{"$f":"+'INGRESO DE DATOS'!$C$45","v":46}]
[]
["Fecha de la cotización",{"$f":"NOW()","v":"2026-01-12T09:32:49.510"}]
[]
["GLOBAL ULTIMATE HEALTH PLAN"]
["DEDUCIBLES","PLAN 1","PLAN 2"]
["En el país de residencia","$0",1000]
["Fuera del país de residencia","$0",1000]
[null,"TARIFAS ANUALES"]
[null,{"$f":"'Global Ultimate'!C38","v":145466.72},{"$f":"'Global Ultimate'!D38","v":93884}]
[null,"TARIFAS SEMESTRALES"]
[null,{"$f":"'Global Ultimate'!C50","v":77052.841600000014},{"$f":"'Global Ultimate'!D50","v":49714.000000000007}]
{"$rows_left_out":61}
{"sheet":"Tablas","index":7,"n_rows":1508,"n_cols":20,"rows_kept":1508,"cut":false,"hidden":true,"merged":[[1285,0,1285,1],[1284,2,1284,6],[1435,0,1435,6],[1437,0,1437,1],[1436,2,1436,6],[1357,0,1357,6],[1358,0,1358,6],[1360,0,1360,1],[1359,2,1359,6],[1434,0,1434,6],[1208,0,1208,6],[1210,0,1210,1],[1209,2,1209,6],[1282,0,1282,6],[1283,0,1283,6],[1059,0,1059,1],[1058,2,1058,6],[1133,0,1133,6],[1134,0,1134,6],[1136,0,1136,1],[1135,2,1135,6],[982,0,982,6],[984,0,984,1],[983,2,983,6],[1056,0,1056,6],[1057,0,1057,6],[2,0,2,7],[1,0,1,7],[907,0,907,6],[908,0,908,6],[910,0,910,1],[909,2,909,6],[78,0,78,1],[77,2,77,6],[76,0,76,6],[4,0,4,1],[3,0,3,7],[153,2,153,6],[226,0,226,6],[228,0,228,1],[377,0,377,6],[227,2,227,6],[755,0,755,6],[831,0,831,6],[530,2,530,6],[603,0,603,6],[604,0,604,6],[830,0,830,6],[1,20,1,22],[758,0,758,1],[757,2,757,6],[379,0,379,1],[378,2,378,6],[151,0,151,6],[152,0,152,6],[154,0,154,1],[2,12,2,13],[3,12,3,13],[1,8,1,9],[4,8,4,13],[4,14,4,19],[302,0,302,6],[303,0,303,6],[305,0,305,1],[1136,8,1136,9],[1136,11,1136,12],[910,8,910,10],[910,12,910,14],[454,0,454,6],[456,0,456,1],[455,2,455,6],[528,0,528,6],[531,0,531,1],[833,0,833,1],[832,2,832,6],[756,0,756,6],[680,0,680,6],[681,0,681,6],[683,0,683,1],[682,2,682,6],[154,8,154,12],[305,8,305,12],[154,13,154,17],[305,13,305,17],[605,0,605,1],[605,2,605,6],[304,2,304,6],[529,0,529,6],[453,0,453,6]]}
[]
["BUPA GLOBAL ELITE",null,null,null,null,null,null,null,"FACTOR MENSUAL:",null,9.3333333333333338E-2,null,"Descuento de 24 años",{"$f":"'INGRESO DE DATOS'!P30","v":1},"Ultimate","Elite","Premier","Select","Major Medical"]
["TARIFAS ANUALES",null,null,null,null,null,null,null,"FACTOR TRIMESTRAL:",null,0.27500000000000002,null,"Descuento de producto (%)",null,{"$f":"'INGRESO DE DATOS'!O39","v":0},{"$f":"'INGRESO DE DATOS'!P39","v":0.15},{"$f":"'INGRESO DE DATOS'!Q39","v":0.25},{"$f":"'INGRESO DE DATOS'!R39","v":0.15},{"$f":"'INGRESO DE DATOS'!S39","v":0.15}]
[null,null,null,null,null,null,null,null,"FACTOR SEMIANUAL:",null,0.53,null,"Factor para el descuento combinado",null,{"$f":"'INGRESO DE DATOS'!O47","v":1},{"$f":"'INGRESO DE DATOS'!P47","v":0.85},{"$f":"'INGRESO DE DATOS'!Q47","v":0.75},{"$f":"'INGRESO DE DATOS'!R47","v":0.85},{"$f":"'INGRESO DE DATOS'!S47","v":0.85}]
["EDAD",null,1000,2000,3500,5000,10000,20000,"TARIFAS BASE",null,null,null,null,null,"TARIFAS BASE CON DESCUENTO"]
[18,null,{"$f":"O6","v":12444},{"$f":"P6","v":10904.65},9010.85,7810.65,5904.95,4664.8,14640,12829,10601,9189,6947,5488,{"$f":"I6*$P$4","v":12444},{"$f":"J6*$P$4","v":10904.65},9010.85,7810.65,5904.95,4664.8]
[19,null,{"$f":"O7","v":12593.6},{"$f":"P7","v":11038.949999999999},{"$f":"Q7","v":9105.1999999999989},{"$f":"R7","v":7897.3499999999995},{"$f":"S7","v":5969.55},4715.8,14816,12987,10712,9291,7023,5548,{"$f":"I7*$P$4","v":12593.6},{"$f":"J7*$P$4","v":11038.949999999999},{"$f":"K7*$P$4","v":9105.1999999999989},{"$f":"L7*$P$4","v":7897.3499999999995},{"$f":"M7*$P$4","v":5969.55},4715.8]
[20,null,12755.1,11175.8,9205.5,7982.3499999999995,6031.5999999999995,4765.0999999999995,15006,13148,10830,9391,7096,5606,12755.1,11175.8,9205.5,7982.3499999999995,6031.5999999999995,4765.0999999999995]
[21,null,12913.199999999999,11320.3,9308.35,8072.45,6102.15,4819.5,15192,13318,10951,9497,7179,5670,12913.199999999999,11320.3,9308.35,8072.45,6102.15,4819.5]
[22,null,13080.65,11465.65,9418,8166.8,6171.8499999999995,4875.5999999999995,15389,13489,11080,9608,7261,5736,13080.65,11465.65,9418,8166.8,6171.8499999999995,4875.5999999999995]
[23,null,13253.199999999999,11620.35,9531.0499999999993,8263.6999999999989,6244.95,4933.3999999999996,15592,13671,11213,9722,7347,5804,13253.199999999999,11620.35,9531.0499999999993,8263.6999999999989,6244.95,4933.3999999999996]
[24,null,13430.85,11777.6,9644.1,8364,6320.5999999999995,4993.75,15801,13856,11346,9840,7436,5875,13430.85,11777.6,9644.1,8364,6320.5999999999995,4993.75]
[25,null,13619.55,11936.55,9761.4,8463.4499999999989,6399.65,5055.8,16023,14043,11484,9957,7529,5948,13619.55,11936.55,9761.4,8463.4499999999989,6399.65,5055.8]
[26,null,13886.449999999999,12170.3,9939.0499999999993,8618.15,6513.55,5145.8999999999996,16337,14318,11693,10139,7663,6054,13886.449999999999,12170.3,9939.0499999999993,8618.15,6513.55,5145.8999999999996]
[27,null,14161.85,12416.8,10119.25,8776.25,6630.8499999999995,5239.3999999999996,16661,14608,11905,10325,7801,6164,14161.85,12416.8,10119.25,8776.25,6630.8499999999995,5239.3999999999996]
[28,null,14453.4,12670.949999999999,10308.799999999999,8938.6,6757.5,5338,17004,14907,12128,10516,7950,6280,14453.4,12670.949999999999,10308.799999999999,8938.6,6757.5,5338]
[29,null,14755.15,12933.6,10509.4,9112.85,6885.8499999999995,5439.15,17359,15216,12364,10721,8101,6399,14755.15,12933.6,10509.4,9112.85,6885.8499999999995,5439.15]
[30,null,15065.4,13208.15,10718.5,9294.75,7022.7,5547.95,17724,15539,12610,10935,8262,6527,15065.4,13208.15,10718.5,9294.75,7022.7,5547.95]
[31,null,15390.949999999999,13494.6,10925.05,9476.65,7159.55,5655.9,18107,15876,12853,11149,8423,6654,15390.949999999999,13494.6,10925.05,9476.65,7159.55,5655.9]
[32,null,15722.449999999999,13780.199999999999,11153.699999999999,9673,7307.45,5773.2,18497,16212,13122,11380,8597,6792,15722.449999999999,13780.199999999999,11153.699999999999,9673,7307.45,5773.2]
[33,null,16071.8,14087.9,11378.949999999999,9871.0499999999993,7458.75,5892.2,18908,16574,13387,11613,8775,6932,16071.8,14087.9,11378.949999999999,9871.0499999999993,7458.75,5892.2]
[34,null,16427.95,14395.6,11617.8,10078.449999999999,7611.75,6013.75,19327,16936,13668,11857,8955,7075,16427.95,14395.6,11617.8,10078.449999999999,7611.75,6013.75]
[35,null,16793.45,14719.449999999999,11865.15,10289.25,7775.8,6142.0999999999995,19757,17317,13959,12105,9148,7226,16793.45,14719.449999999999,11865.15,10289.25,7775.8,6142.0999999999995]
[36,null,17170.849999999999,15049.25,12114.199999999999,10506.85,7937.3,6269.5999999999995,20201,17705,14252,12361,9338,7376,17170.849999999999,15049.25,12114.199999999999,10506.85,7937.3,6269.5999999999995]
[37,null,17559.3,15392.65,12381.949999999999,10737.199999999999,8113.25,6409.8499999999995,20658,18109,14567,12632,9545,7541,17559.3,15392.65,12381.949999999999,10737.199999999999,8113.25,6409.8499999999995]
[38,null,17962.2,15744.55,12650.55,10970.1,8287.5,6546.7,21132,18523,14883,12906,9750,7702,17962.2,15744.55,12650.55,10970.1,8287.5,6546.7]
[39,null,18371.05,16102.4,12928.5,11208.949999999999,8471.9499999999989,6692.9,21613,18944,15210,13187,9967,7874,18371.05,16102.4,12928.5,11208.949999999999,8471.9499999999989,6692.9]
[40,null,18790.099999999999,16473,13209.85,11456.3,8658.1,6839.0999999999995,22106,19380,15541,13478,10186,8046,18790.099999999999,16473,13209.85,11456.3,8658.1,6839.0999999999995]
[41,null,19226.149999999998,16853.8,13506.5,11709.6,8851.0499999999993,6991.25,22619,19828,15890,13776,10413,8225,19226.149999999998,16853.8,13506.5,11709.6,8851.0499999999993,6991.25]
[42,null,19672.399999999998,17239.7,13809.949999999999,11975.65,9048.25,7147.65,23144,20282,16247,14089,10645,8409,19672.399999999998,17239.7,13809.949999999999,11975.65,9048.25,7147.65]
{"$rows_left_out":1478}